<?xml version="1.0"?>
<robot xmlns:xacro="http://www.ros.org/wiki/xacro">

  <!-- Include dei file necessari -->
  <xacro:include filename="$(find uuv_descriptions)/urdf/common.urdf.xacro"/>
  <xacro:include filename="$(find uuv_sensor_ros_plugins)/urdf/sensor_snippets.xacro"/>
  <xacro:include filename="$(find bluerov1_description)/urdf/snippets.xacro"/>
  <xacro:include filename="$(find uuv_gazebo_ros_plugins)/urdf/snippets.xacro"/>

  <!-- Parametri del BlueROV -->
  <xacro:property name="mass" value="8.53"/>
  <xacro:property name="x_size" value="0.530"/>
  <xacro:property name="y_size" value="0.330"/>
  <xacro:property name="z_size" value="0.267"/>
  <xacro:property name="volume" value="0.00841886"/>
  <xacro:property name="cog" value="0 0 0"/>
  <xacro:property name="cob" value="0 0 0.28"/>
  <xacro:property name="rho" value="1028"/>
  <xacro:property name="visual_mesh_file" value="file://$(find bluerov1_description)/meshes/bluerov1_noprop.dae"/>
  <xacro:property name="collision_mesh_file" value="file://$(find bluerov1_description)/meshes/bluerov1_noprop.dae"/>

  <!-- Definizione del BlueROV -->
  <xacro:macro name="bluerov1_base" params="namespace with_docking *gazebo">

    <!-- Link principale -->
    <link name="${namespace}/base_link">
      <inertial>
        <mass value="${mass}" />
        <origin xyz="${cog}" rpy="0 0 0"/>
        <inertia
          ixx="${0.2*mass*y_size*y_size + 0.2*mass*z_size*z_size}" ixy="0.0" ixz="0.0"
          iyy="${0.2*mass*x_size*x_size + 0.2*mass*z_size*z_size}" iyz="0.0"
          izz="${0.2*mass*x_size*x_size + 0.2*mass*y_size*y_size}" />
      </inertial>
      <visual>
        <origin xyz="0 0 0" rpy="0 0 0"/>
        <geometry>
          <mesh filename="${visual_mesh_file}" scale="1 1 1" />
        </geometry>
      </visual>
      <collision>
        <origin xyz="0 0 0" rpy="0 0 0"/>
        <geometry>
          <mesh filename="${collision_mesh_file}" scale="1 1 1" />
        </geometry>
      </collision>
    </link>

    <!-- Gazebo plugin -->
    <gazebo reference="${namespace}/base_link">
      <selfCollide>false</selfCollide>
    </gazebo>

    <!-- Aggiunta del blocco magnetico -->
    <link name="${namespace}/magnet_block">
      <inertial>
        <mass value="1.0"/>
        <origin xyz="0 0 0" rpy="0 0 0"/>
        <inertia ixx="0.001" ixy="0.0" ixz="0.0" iyy="0.001" iyz="0.0" izz="0.001"/>
      </inertial>
      <visual>
        <origin xyz="0 0 0" rpy="0 0 0"/>
        <geometry>
          <box size="0.2 0.2 0.05"/>
        </geometry>
        <material name="magnet_material">
          <ambient>0.5 0.5 0.5 1</ambient>
        </material>
      </visual>
      <collision>
        <origin xyz="0 0 0" rpy="0 0 0"/>
        <geometry>
          <box size="0.2 0.2 0.05"/>
        </geometry>
      </collision>
    </link>

    <!-- Joint per collegare il magnete -->
    <joint name="${namespace}/magnet_joint" type="fixed">
      <parent>${namespace}/base_link</parent>
      <child>${namespace}/magnet_block</child>
      <origin xyz="0.4 0 0" rpy="0 0 0"/>
    </joint>

    <!-- Plugin per il magnete -->
    <gazebo reference="${namespace}/magnet_block">
      <plugin name="${namespace}_magnet_plugin" filename="libstorm_gazebo_dipole_magnet.so">
        <bodyName>${namespace}/magnet_block</bodyName>
        <dipole_moment>10000 0 10000</dipole_moment>
        <xyzOffset>0 0 0</xyzOffset>
        <shouldPublish>true</shouldPublish>
        <topicNs>${namespace}/magnet</topicNs>
        <updateRate>100</updateRate>
      </plugin>
    </gazebo>

    <!-- Include degli attuatori e dei sensori -->
    <xacro:include filename="$(find bluerov1_description)/urdf/actuators.xacro" />
    <xacro:include filename="$(find bluerov1_description)/urdf/sensors.xacro"/>

  </xacro:macro>

</robot>

